{"text_format":"1","workbook":"xlsx","n_sheets":4,"sheets":["Price calculator","Help sheet","DB Koder Danmark","DB Koder Danmark old db07"],"not_rendered":{"charts":0,"images":0,"macros":0,"external_links":0,"defined_names":2,"comments":0,"pivot_tables":0},"unopened":[],"bounds":{"document_bytes":16777216,"sheet_cells":100000,"rows_first":2000,"rows_last":500,"rows_between":2000,"halvings":0,"cell_chars":16384,"cell_head_chars":4096},"cells_cut":0,"cells_raw":0,"read":"whole","date_system":"1900"}

{"sheet":"Price calculator","index":0,"n_rows":38,"n_cols":6,"rows_kept":38,"cut":false,"hidden":false,"merged":[]}
[]
[null,"Input"]
[]
[null,null,"Firmanavn","Selskab XXX"]
[null,null,"Address","Paradisæblevej 7"]
[null,null,"Post nr.","4700 Andeby"]
[null,null,"CVR.nr."]
[]
[null,null,"DB Kode","01.11.00"]
[null,null,"DB Kode navn",{"$f":"INDEX('DB Koder Danmark'!$B$2:$C$744,MATCH(D9,'DB Koder Danmark'!$B$2:$B$744,0),2)","v":"Dyrkning af korn (undtagen ris), bælgfrugter og olieholdige frø"},null," "]
[null,null,"Omsætning",250000000]
[null,null,"Etableringsår",2009]
[null,null,"Etableringsmåned","03"]
[null,null,"Minimum 12 mdr. på aktivt cvr.nr.","Ja"]
[null,null,"Antal medarbejdere",12]
[null,null,"Har kunden en igangværende retshjælpsforsikring? ","Ja"]
[]
[null,null,"Selvrisiko",25000]
[null,null,"Præmie",{"$f":"IF(D11>250000000,\"Kontakt HELP for tilbud\",IF(OR(D11=\"\",D11=0),\"FEJL\",IF('Help sheet'!M2=\"x\",\"\",IF(OR(D11>120000000,D33=0),D35,D35))))","v":38685.423622642171}]
[null,null,{"$f":"IF(D14=\"nei\",\"OBS!\",IF(OR(D11>120000000,D33=0),\"OBS!\",\"\"))","v":"OBS!"},{"$f":"IF(D14=\"Nei\",\"Kan ikke indtegnes\",IF('Help sheet'!M2=\"x\",\"Kan ikke indtegnes\",IF(OR(D11>120000000,D33=0),\"Medsend min. 3 års skadesoplysninger\",\"\")))","v":"Medsend min. 3 års skadesoplysninger"}]
[null,null,"Vigtige præmieoplysninger","OBS! Der gælder til enhver tid en minimumspræmie på kr. 3.000"]
[]
[]
[null,"præmie"]
[]
[null,null,"Minimum Præmie",3000]
[null,null,"Indvendig og udvendig kerne",{"$f":"'Help sheet'!O18","v":33569.004474805224}]
[null,null,"Huslov",{"$f":"'Help sheet'!O21","v":22.727708180130563}]
[null,null,"Arbejdsret",{"$f":"'Help sheet'!O19","v":5027.1250937428995}]
[null,null,"ID-tyveri",{"$f":"'Help sheet'!O20","v":66.566345913916933}]
[null,null,"Præmie før rabat",{"$f":"SUM(D27:D30)","v":38685.423622642171}]
[]
[null,null,"Rabat",{"$f":"INDEX('DB Koder Danmark'!$B$2:$E$744,MATCH(D9,'DB Koder Danmark'!$B$2:$B$744,0),4)","v":0}]
[]
[null,null,"Endelig præmie",{"$f":"IF(D33=0,IF(((1-D33)*D27)+D28+D29+D30<D26,D26,((1-D33)*D27)+D28+D29+D30),IF(((1-D33)*D27)+D28+D29+D30<D26,D26,((1-D33)*D27)+D28+D29+D30))","v":38685.423622642171}]
[]
[]
[null,null,{"$f":"IF(OR(D33=0,D11>=120000000,),\"Må forhåndsgodkendes af HELP!\",\"\")","v":"Må forhåndsgodkendes af HELP!"}]

{"sheet":"Help sheet","index":1,"n_rows":196,"n_cols":38,"rows_kept":196,"cut":false,"hidden":true,"merged":[[1,22,80,22],[1,27,3,29],[1,31,3,33],[1,35,3,37],[4,27,5,29],[4,31,5,33],[4,35,5,37],[65,27,67,29],[65,31,67,33],[65,35,67,37],[22,27,24,29],[22,31,24,33],[22,35,24,37],[68,23,69,25],[68,27,69,29],[68,31,69,33],[68,35,69,37],[48,23,49,25],[65,23,67,25],[25,31,26,33],[25,35,26,37],[45,27,47,29],[45,31,47,33],[45,35,47,37],[25,27,26,29],[48,27,49,29],[48,31,49,33],[48,35,49,37],[1,23,3,25],[4,23,5,25],[22,23,24,25],[25,23,26,25],[45,23,47,25]]}
["Sales channel drop down",null,"Deductible drop down",null,"Minimum 12 måneder",null,"Year drop down",null,null,"Month drop down","minimum premium",null,"Check if not valid to cover branch"]
["Hard bundled",null,5000,null,"Ja",{"$f":"YEAR(TODAY())","v":2025},{"$f":"F2","v":2025},null,null,"01",3000,null,{"$f":"INDEX('DB Koder Danmark'!$B$2:$F$744,MATCH('Price calculator'!D9,'DB Koder Danmark'!$B$2:$B$744,0),5)","v":0},null,null,null,null,null,null,null,null,null,"PREMIUM LEVEL","Inside and outside core\nSales channel = Add-on\nSelected",null,null,null,"Inside and outside core\nSales channel = Add-on\nDeductible = 5000",null,null,null,"Inside and outside core\nSales channel = Add-on\nDeductible = 10 000",null,null,null,"Inside and outside core\nSales channel = Add-on\nDeductible = 25 000"]
["Add-on",null,10000,null,"Nei",null,{"$f":"G2-1","v":2024},null,null,"02"]
["Individually bought",null,25000,null,null,null,{"$f":"G3-1","v":2023},null,null,"03"]
[null,null,null,null,null,null,2022,null,null,"04",null,null,null,null,null,null,"Turnover category","Selected row",null,null,null,null,null,"Burning costs DKK",null,null,null,"Burning costs DKK",null,null,null,"Burning costs DKK",null,null,null,"Burning costs DKK"]
[null,null,null,null,null,null,2021,null,null,"05",null,null,null,null,null,null,6000000,{"$f":"IF($N$8<=Q6,1,0)","v":0},null,"Turnover row selected","age column selected"]
[null,null,null,null,null,null,2020,null,null,"06",null,null,"Years active",{"$f":"YEAR(TODAY())-'Price calculator'!$D$12","v":16},null,null,12000000,{"$f":"IF(AND(Q6<$N$8,$N$8<=Q7),2,0)","v":0},null,{"$f":"SUM(R6:R14)","v":9},{"$f":"IF(N7<=14,1,2)","v":2},null,null,null,"Age",null,null,null,"Age",null,null,null,"Age",null,null,null,"Age"]
[null,null,null,null,null,null,2019,null,null,"07",null,null,"Turnover",{"$f":"'Price calculator'!D11","v":250000000},null,null,18000000,{"$f":"IF(AND(Q7<$N$8,$N$8<=Q8),3,0)","v":0},null,null,null,null,null,"Turnover","<=14","<=1 000",null,"Turnover","<=14","<=1 000",null,"Turnover","<=14","<=1 000",null,"Turnover","<=14","<=1 000"]
[null,null,null,null,null,null,2018,null,null,"08",null,null,"Deductible",{"$f":"'Price calculator'!D18","v":25000},null,null,24000000,{"$f":"IF(AND(Q8<$N$8,$N$8<=Q9),4,0)","v":0},null,null,null,null,null,"<=6 000 000",{"$f":"IF($N$9=5000,AC9,IF($N$9=10000,AG9,AK9))","v":3846.7752362815213},{"$f":"IF($N$9=5000,AD9,IF($N$9=10000,AH9,AL9))","v":2741.1054709402897},null,"<=6 000 000",4350.8135490876566,3100.2692098989382,null,"<=6 000 000",4224.8039708861234,3010.4782751592761,null,"<=6 000 000",3846.7752362815213,2741.1054709402897]
[null,null,null,null,null,null,2017,null,null,"09",null,null,null,null,null,null,40000000,{"$f":"IF(AND(Q9<$N$8,$N$8<=Q10),5,0)","v":0},null,null,null,null,null,"<=12 000 000",{"$f":"IF($N$9=5000,AC10,IF($N$9=10000,AG10,AK10))","v":5193.1465689800534},{"$f":"IF($N$9=5000,AD10,IF($N$9=10000,AH10,AL10))","v":3700.4923857693911},null,"<=12 000 000",5873.5982912683357,4185.3634333635664,null,"<=12 000 000",5703.485360696267,4064.1456714650235,null,"<=12 000 000",5193.1465689800534,3700.4923857693911]
[null,null,null,null,null,null,2016,null,null,"10",null,null,null,null,null,null,80000000,{"$f":"IF(AND(Q10<$N$8,$N$8<=Q11),6,0)","v":0},null,null,null,null,null,"<=18 000 000",7391.7485460439293,5267.1552494867774,null,"<=18 000 000",8360.2804297618477,5957.3042397890022,null,"<=18 000 000",8118.1474588323717,5784.7669922134455,null,"<=18 000 000",7391.7485460439293,5267.1552494867774]
[null,null,null,null,null,null,2015,null,null,"11",null,null,null,null,null,null,120000000,{"$f":"IF(AND(Q11<$N$8,$N$8<=Q12),7,0)","v":0},null,null,null,null,null,"<=24 000 000",9609.2731098571112,6847.3018243328106,null,"<=24 000 000",10868.364558690406,7744.4955117257014,null,"<=24 000 000",10553.591696482084,7520.1970898774807,null,"<=24 000 000",9609.2731098571112,6847.3018243328106]
[null,null,null,null,null,null,2014,null,null,"12",null,null,null,null,null,null,180000000,{"$f":"IF(AND(Q12<$N$8,$N$8<=Q13),8,0)","v":0},null,null,null,null,null,"<=40 000 000",11315.521952343832,8063.1274833975485,null,"<=40 000 000",12798.181126081628,9119.6293383385346,null,"<=40 000 000",12427.516332647181,8855.5038746032878,null,"<=40 000 000",11315.521952343832,8063.1274833975485]
[null,null,null,null,null,null,2013,null,null,null,null,null,null,null,null,null,250000000,{"$f":"IF(AND(Q13<$N$8,$N$8<=Q14),9,0)","v":9},null,null,null,null,null,"<=80 000 000",18034.113111547988,12850.60942666484,null,"<=80 000 000",20397.101169692596,14534.409257977037,null,"<=80 000 000",19806.354155156441,14113.459300148988,null,"<=80 000 000",18034.113111547988,12850.60942666484]
[null,null,null,null,null,null,2012,null,null,null,null,null,null,null,null,null,null,null,null,null,null,null,null,"<=120 000 000",27051.169667321978,19275.914139997261,null,"<=120 000 000",30595.651754538892,21801.613886965559,null,"<=120 000 000",29709.531232734669,21170.188950223488,null,"<=120 000 000",27051.169667321978,19275.914139997261]
[null,null,null,null,null,null,2011,null,null,null,null,null,null,null,null,null,null,null,null,null,null,null,null,"<=180 000 000",36519.079050884669,26022.484088996309,null,"<=180 000 000",41304.129868627497,29432.178747403505,null,"<=180 000 000",40107.867164191797,28579.755082801701,null,"<=180 000 000",36519.079050884669,26022.484088996309]
[null,null,null,null,null,null,2010,null,null,null,null,null,null,null,null,null,null,null,null,null,null,null,null,"<=250 000 000",47109.611975641223,33569.004474805224,null,"<=250 000 000",53282.327530529474,37967.510584150514,null,"<=250 000 000",51739.148641807406,36867.884056814204,null,"<=250 000 000",47109.611975641223,33569.004474805224]
[null,null,null,null,null,null,2009,null,null,null,null,null,null,"Inside and outside core",{"$f":"INDEX($Y$9:$Z$17,$T$7,$U$7)","v":33569.004474805224}]
[null,null,null,null,null,null,2008,null,null,null,null,null,null,"Labor law",{"$f":"INDEX($Y$30:$Z$38,$T$7,$U$7)","v":5027.1250937428995}]
[null,null,null,null,null,null,2007,null,null,null,null,null,null,"Id-theft",{"$f":"INDEX($Y$53:$Z$61,$T$7,$U$7)","v":66.566345913916933}]
[null,null,null,null,null,null,2006,null,null,null,null,null,null,"Rental law",{"$f":"INDEX($Y$73:$Z$81,$T$7,$U$7)","v":22.727708180130563}]
[null,null,null,null,null,null,2005]
[null,null,null,null,null,null,2004,null,null,null,null,null,null,null,null,null,null,null,null,null,null,null,null,"Labor law\nSales channel = Add-on\nSelected",null,null,null,"Labor law\nSales channel = Add-on\nDeductible = 5 000",null,null,null,"Labor law\nSales channel = Add-on\nDeductible = 10 000",null,null,null,"Labor law\nSales channel = Add-on\nDeductible = 25 000"]
[null,null,null,null,null,null,2003]
[null,null,null,null,null,null,2002]
[null,null,null,null,null,null,2001,null,null,null,null,null,null,null,null,null,null,null,null,null,null,null,null,"Burning costs DKK",null,null,null,"Burning costs DKK",null,null,null,"Burning costs DKK",null,null,null,"Burning costs DKK"]
[null,null,null,null,null,null,2000]
[null,null,null,null,null,null,1999,null,null,null,null,null,null,null,null,null,null,null,null,null,null,null,null,null,"Age",null,null,null,"Age",null,null,null,"Age",null,null,null,"Age"]
[null,null,null,null,null,null,1998,null,null,null,null,null,null,null,null,null,null,null,null,null,null,null,null,"Turnover","<=14","<=1 000",null,"Turnover","<=14","<=1 000",null,"Turnover","<=14","<=1 000",null,"Turnover","<=14","<=1 000"]
[null,null,null,null,null,null,1997,null,null,null,null,null,null,null,null,null,null,null,null,null,null,null,null,"<=6 000 000",{"$f":"IF($N$9=5000,AC30,IF($N$9=10000,AG30,AK30))","v":98.440441360948824},{"$f":"IF($N$9=5000,AD30,IF($N$9=10000,AH30,AL30))","v":70.145931540598596},null,"<=6 000 000",111.33897348923267,79.337068223207325,null,"<=6 000 000",108.1143404571617,77.039284052555146,null,"<=6 000 000",98.440441360948824,70.145931540598596]
[null,null,null,null,null,null,1996,null,null,null,null,null,null,null,null,null,null,null,null,null,null,null,null,"<=12 000 000",{"$f":"IF($N$9=5000,AC31,IF($N$9=10000,AG31,AK31))","v":295.3213240828465},{"$f":"IF($N$9=5000,AD31,IF($N$9=10000,AH31,AL31))","v":210.43779462179577},null,"<=12 000 000",334.01692046769807,238.01120466962197,null,"<=12 000 000",324.34302137148512,231.11785215766545,null,"<=12 000 000",295.3213240828465,210.43779462179577]
[null,null,null,null,null,null,1995,null,null,null,null,null,null,null,null,null,null,null,null,null,null,null,null,"<=18 000 000",492.20220680474409,350.72965770299299,null,"<=18 000 000",556.69486744616347,396.68534111603668,null,"<=18 000 000",540.57170228580856,385.19642026277575,null,"<=18 000 000",492.20220680474409,350.72965770299299]
[null,null,null,null,null,null,1994,null,null,null,null,null,null,null,null,null,null,null,null,null,null,null,null,"<=24 000 000",689.08308952664174,491.02152078419022,null,"<=24 000 000",779.37281442462881,555.35947756245139,null,"<=24 000 000",756.80038320013193,539.27498836788595,null,"<=24 000 000",689.08308952664174,491.02152078419022]
[null,null,null,null,null,null,1993,null,null,null,null,null,null,null,null,null,null,null,null,null,null,null,null,"<=40 000 000",1050.0313745167875,748.2232697663851,null,"<=40 000 000",1187.6157172184819,846.26206104754488,null,"<=40 000 000",1153.2196315430583,821.75236322725493,null,"<=40 000 000",1050.0313745167875,748.2232697663851]
[null,null,null,null,null,null,1992,null,null,null,null,null,null,null,null,null,null,null,null,null,null,null,null,"<=80 000 000",1968.8088272189764,1402.918630811972,null,"<=80 000 000",2226.7794697846539,1586.7413644641467,null,"<=80 000 000",2162.2868091432342,1540.785681051103,null,"<=80 000 000",1968.8088272189764,1402.918630811972]
[null,null,null,null,null,null,1991,null,null,null,null,null,null,null,null,null,null,null,null,null,null,null,null,"<=120 000 000",3281.3480453649609,2338.1977180199533,null,"<=120 000 000",3711.2991163077554,2644.5689407735777,null,"<=120 000 000",3603.8113485720569,2567.9761350851718,null,"<=120 000 000",3281.3480453649609,2338.1977180199533]
[null,null,null,null,null,null,1990,null,null,null,null,null,null,null,null,null,null,null,null,null,null,null,null,"<=180 000 000",4922.0220680474413,3507.2965770299297,null,"<=180 000 000",5566.9486744616343,3966.8534111603672,null,"<=180 000 000",5405.7170228580853,3851.964202627757,null,"<=180 000 000",4922.0220680474413,3507.2965770299297]
[null,null,null,null,null,null,1989,null,null,null,null,null,null,null,null,null,null,null,null,null,null,null,null,"<=250 000 000",7054.8982975346653,5027.1250937428995,null,"<=250 000 000",7979.2931000616745,5685.8232226631926,null,"<=250 000 000",7748.1943994299227,5521.1486904331196,null,"<=250 000 000",7054.8982975346653,5027.1250937428995]
[null,null,null,null,null,null,1988]
[null,null,null,null,null,null,1987]
{"$rows_left_out":157}
{"sheet":"DB Koder Danmark","index":2,"n_rows":744,"n_cols":6,"rows_kept":744,"cut":false,"hidden":true,"merged":[]}
["NB","DB25","Titler","127 std","Præmiereduktion","Do not include"]
[" ","01.11.00","Dyrkning af korn (undtagen ris), bælgfrugter og olieholdige frø","Landbrug og gartneri",0]
[" ","01.12.00","Dyrkning af ris","Landbrug og gartneri",0]
[" ","01.13.00","Dyrkning af grøntsager og meloner, rødder og rodknolde","Landbrug og gartneri",0]
[" ","01.14.00","Dyrkning af sukkerrør","Landbrug og gartneri",0]
[" ","01.15.00","Dyrkning af tobak","Landbrug og gartneri",0]
[" ","01.16.00","Dyrkning af tekstilplanter","00.16.01",0]
[" ","01.19.00","Dyrkning af andre etårige afgrøder","Landbrug og gartneri",0]
[" ","01.21.00","Dyrkning af druer","Landbrug og gartneri",0]
[" ","01.22.00","Dyrkning af tropiske og subtropiske frugter","Landbrug og gartneri",0]
[" ","01.23.00","Dyrkning af citrusfrugter","Landbrug og gartneri",0]
[" ","01.24.00","Dyrkning af kernefrugter og stenfrugter","Landbrug og gartneri",0]
[" ","01.25.00","Dyrkning af andre træfrugter, bær og nødder","Landbrug og gartneri",0]
[" ","01.26.00","Dyrkning af olieholdige frugter","Landbrug og gartneri",0]
[" ","01.27.00","Dyrkning af planter til fremstilling af drikkevarer","Landbrug og gartneri",0]
[" ","01.28.00","Dyrkning af krydderiplanter, aromaplanter og lægeplanter","Landbrug og gartneri",0]
[" ","01.29.00","Dyrkning af andre flerårige afgrøder","Landbrug og gartneri",0]
[" ","01.30.00","Planteformering","Landbrug og gartneri",0]
[" ","01.41.00","Avl af malkekvæg","Landbrug og gartneri",0]
[" ","01.42.00","Avl af andet kvæg og bøfler","Landbrug og gartneri",0]
[" ","01.43.00","Avl af heste og dyr af hestefamilien","Landbrug og gartneri",0]
[" ","01.44.00","Avl af kameler og dyr af kamelfamilien","Landbrug og gartneri",0]
[" ","01.45.00","Avl af får og geder","Landbrug og gartneri",0]
[" ","01.46.10","Avl af smågrise","Landbrug og gartneri",0]
[" ","01.46.20","Produktion af slagtesvin","Landbrug og gartneri",0]
[" ","01.47.00","Fjerkræavl","Landbrug og gartneri",0]
[" ","01.48.00","Kenneler","Landbrug og gartneri",0]
[" ","01.48.00","Avl af pelsdyr mv.","Landbrug og gartneri",0]
[" ","01.50.00","Blandet drift","Landbrug og gartneri",0]
[" ","01.61.00","Serviceydelser i forbindelse med planteavl","Landbrug og gartneri",0]
[" ","01.62.00","Serviceydelser i forbindelse med husdyravl","Landbrug og gartneri",0]
[" ","01.63.00","Forarbejdning af afgrøder efter høst","Landbrug og gartneri",0]
[" ","01.63.00","Forarbejdning af frø/sædekorn til udsæd","Landbrug og gartneri",0]
[" ","01.70.00","Jagt, fældefangst og serviceydelser i forbindelse hermed","Landbrug og gartneri",0]
[" ","02.10.00","Dyrkning af træer og andre skovbrugsaktiviteter","Skovbrug",0]
[" ","02.20.00","Skovning","Skovbrug",0]
[" ","02.30.00","Indsamling af vildtvoksende forstmateriale undtagen træer","Skovbrug",0]
[" ","02.40.00","Serviceydelser til skovbrug","Skovbrug",0]
[" ","03.11.00","Havfiskeri","Fiskeri",0]
[" ","03.12.00","Ferskvandsfiskeri","Fiskeri",0]
{"$rows_left_out":705}
{"sheet":"DB Koder Danmark old db07","index":3,"n_rows":744,"n_cols":11,"rows_kept":744,"cut":false,"hidden":true,"merged":[]}
["NB","DB25","Titler","127 std","Præmiereduktion","Do not include","Ny verdi",null,"DB07","DB25","DB07"]
[" ","2000-11-01","Dyrkning af korn (undtagen ris), bælgfrugter og olieholdige frø","Landbrug og gartneri",0,null,{"$f":"IFERROR(INDEX($I$2:$K$737,MATCH(B2,$K$2:$K$737,0),2),B2)","v":"01.11.00"},null,"01.11.00","01.11.00","2000-11-01"]
[" ","2000-12-01","Dyrkning af ris","Landbrug og gartneri",0,null,{"$f":"IFERROR(INDEX($I$2:$K$737,MATCH(B3,$K$2:$K$737,0),2),B3)","v":"01.12.00"},null,"01.12.00","01.12.00","2000-12-01"]
[" ","01.13.00","Dyrkning af grøntsager og meloner, rødder og rodknolde","Landbrug og gartneri",0,null,"01.13.00",null,"01.13.00","01.13.00","01.13.00"]
[" ","01.14.00","Dyrkning af sukkerrør","Landbrug og gartneri",0,null,"01.14.00",null,"01.14.00","01.14.00","01.14.00"]
[" ","01.15.00","Dyrkning af tobak","Landbrug og gartneri",0,null,"01.15.00",null,"01.15.00","01.15.00","01.15.00"]
[" ","01.16.00","Dyrkning af tekstilplanter","00.16.01",0,null,"01.16.00",null,"01.16.00","01.16.00","01.16.00"]
[" ","01.19.00","Dyrkning af andre etårige afgrøder","Landbrug og gartneri",0,null,"01.19.00",null,"01.19.00","01.19.00","01.19.00"]
[" ","01.21.00","Dyrkning af druer","Landbrug og gartneri",0,null,"01.21.00",null,"01.21.00","01.21.00","01.21.00"]
[" ","01.22.00","Dyrkning af tropiske og subtropiske frugter","Landbrug og gartneri",0,null,"01.22.00",null,"01.22.00","01.22.00","01.22.00"]
[" ","01.23.00","Dyrkning af citrusfrugter","Landbrug og gartneri",0,null,"01.23.00",null,"01.23.00","01.23.00","01.23.00"]
[" ","01.24.00","Dyrkning af kernefrugter og stenfrugter","Landbrug og gartneri",0,null,"01.24.00",null,"01.24.00","01.24.00","01.24.00"]
[" ","01.25.00","Dyrkning af andre træfrugter, bær og nødder","Landbrug og gartneri",0,null,"01.25.00",null,"01.25.00","01.25.00","01.25.00"]
[" ","01.26.00","Dyrkning af olieholdige frugter","Landbrug og gartneri",0,null,"01.26.00",null,"01.26.00","01.26.00","01.26.00"]
[" ","01.27.00","Dyrkning af planter til fremstilling af drikkevarer","Landbrug og gartneri",0,null,"01.27.00",null,"01.27.00","01.27.00","01.27.00"]
[" ","01.28.00","Dyrkning af krydderiplanter, aromaplanter og lægeplanter","Landbrug og gartneri",0,null,"01.28.00",null,"01.28.00","01.28.00","01.28.00"]
[" ","01.29.00","Dyrkning af andre flerårige afgrøder","Landbrug og gartneri",0,null,"01.29.00",null,"01.29.00","01.29.00","01.29.00"]
[" ","01.30.00","Planteformering","Landbrug og gartneri",0,null,"01.30.00",null,"01.30.00","01.30.00","01.30.00"]
[" ","01.41.00","Avl af malkekvæg","Landbrug og gartneri",0,null,"01.41.00",null,"01.41.00","01.41.00","01.41.00"]
[" ","01.42.00","Avl af andet kvæg og bøfler","Landbrug og gartneri",0,null,"01.42.00",null,"01.42.00","01.42.00","01.42.00"]
[" ","01.43.00","Avl af heste og dyr af hestefamilien","Landbrug og gartneri",0,null,"01.43.00",null,"01.43.00","01.43.00","01.43.00"]
[" ","01.44.00","Avl af kameler og dyr af kamelfamilien","Landbrug og gartneri",0,null,"01.44.00",null,"01.44.00","01.44.00","01.44.00"]
[" ","01.45.00","Avl af får og geder","Landbrug og gartneri",0,null,"01.45.00",null,"01.45.00","01.45.00","01.45.00"]
[" ","01.46.10","Avl af smågrise","Landbrug og gartneri",0,null,"01.46.10",null,"01.46.10","01.46.10","01.46.10"]
[" ","01.46.20","Produktion af slagtesvin","Landbrug og gartneri",0,null,"01.46.20",null,"01.46.20","01.46.20","01.46.20"]
[" ","01.47.00","Fjerkræavl","Landbrug og gartneri",0,null,"01.47.00",null,"01.47.00","01.47.00","01.47.00"]
[" ","01.49.10","Kenneler","Landbrug og gartneri",0,null,"01.48.00",null,"01.49.10","01.48.00","01.49.10"]
[" ","01.49.20","Avl af pelsdyr mv.","Landbrug og gartneri",0,null,"01.48.00",null,"01.49.20","01.48.00","01.49.20"]
[" ","01.50.00","Blandet drift","Landbrug og gartneri",0,null,"01.50.00",null,"01.50.00","01.50.00","01.50.00"]
[" ","01.61.00","Serviceydelser i forbindelse med planteavl","Landbrug og gartneri",0,null,"01.61.00",null,"01.61.00","01.61.00","01.61.00"]
[" ","01.62.00","Serviceydelser i forbindelse med husdyravl","Landbrug og gartneri",0,null,"01.62.00",null,"01.62.00","01.62.00","01.62.00"]
[" ","01.63.00","Forarbejdning af afgrøder efter høst","Landbrug og gartneri",0,null,"01.63.00",null,"01.63.00","01.63.00","01.63.00"]
[" ","01.64.00","Forarbejdning af frø/sædekorn til udsæd","Landbrug og gartneri",0,null,"01.63.00",null,"01.64.00","01.63.00","01.64.00"]
[" ","01.70.00","Jagt, fældefangst og serviceydelser i forbindelse hermed","Landbrug og gartneri",0,null,"01.70.00",null,"01.70.00","01.70.00","01.70.00"]
[" ","2000-10-02","Dyrkning af træer og andre skovbrugsaktiviteter","Skovbrug",0,null,"02.10.00",null,"02.10.00","02.10.00","2000-10-02"]
[" ","02.20.00","Skovning","Skovbrug",0,null,"02.20.00",null,"02.20.00","02.20.00","02.20.00"]
[" ","02.30.00","Indsamling af vildtvoksende forstmateriale undtagen træer","Skovbrug",0,null,"02.30.00",null,"02.30.00","02.30.00","02.30.00"]
[" ","02.40.00","Serviceydelser til skovbrug","Skovbrug",0,null,"02.40.00",null,"02.40.00","02.40.00","02.40.00"]
[" ","2000-11-03","Havfiskeri","Fiskeri",0,null,"03.11.00",null,"03.11.00","03.11.00","2000-11-03"]
[" ","2000-12-03","Ferskvandsfiskeri","Fiskeri",0,null,"03.12.00",null,"03.12.00","03.12.00","2000-12-03"]
{"$rows_left_out":704}